Actualités & Annonces de l'équipe de développement et des administrateurs du forum.
Répondre

[Stable] Mise à jour 16/08/2022 - Glibc with EAC fix, Nextcloud, KDE-git, Cinnamon, Haskell, Python

#1Messageil y a 1 mois

Bonjour à toutes et à tous :bjr:

Une mise à jour est annoncée
Bonjour la communauté,

Une autre mise à jour de la branche stable dont vous avez maintenant l'habitude.

  • Cela apporte le correctif pour l' EAC suite aux questions que vous aviez avec Proton-Games 21 sur Steam
  • Plus de mises à jour de Cinnamon
  • Nextcloud est maintenant à 24.0.4 3
  • Les régulières mises à jour de KDE-git , Haskell et Python


N'hésitez pas à nous donner vos commentaires sur les modifications apportées aux dépôts.


-------------------------------------------------------------------------------------
Mise à jour possible par pamac, octopi ou par pacman (de préférence) :

sudo pacman -Syu
ou encore

sudo pamac update
-------------------------------------------------------------------------------------

Noyaux pris en charge :
  • linux419 4.19.255
  • linux54 5.4.210
  • linux510 5.10.136
  • linux515 5.15.60
  • linux518 5.18.17
  • linux519 5.19.1
  • linux515-rt 5.15.55_rt48
  • linux518-rt 5.18.0_rt11
  • linux519-rt 5.19.0_rt10
Les changements en détail :
  • community x86_64: 460 nouveaux et 457 paquets retirés
  • core x86_64: 22 nouveaux et 22 paquets retirés
  • extra x86_64: 68 nouveaux et 67 paquets retirés
  • kde-unstable x86_64: 216 nouveaux et 216 paquets retirés
  • multilib x86_64: 5 nouveaux et 5 paquets retirés
-------------------------------------------------------------------------------------


-------------------------------------------------------------------------------------
ERREUR : conflit de fichiers
Si lors de la mise à jour vous avez le type d'erreur comme ci-dessous (tlp est un exemple) :

erreur : la validation de la transaction a échoué (conflit de fichiers)
tlp : /etc/acpi/thinkpad est déjà présent dans le système de fichiers
Des erreurs se sont produites, aucun paquet n’a été mis à jour.
il convient de passer la commande suivante en l'adaptant à votre cas particulier :

sudo pacman -S nom_paquet --overwrite '/etc/acpi/thinkpad'
Ensuite, vous pouvez faire votre mise à jour générale sans problème.
-------------------------------------------------------------------------------------

-------------------------------------------------------------------------------------
Problèmes liés à la synchronisation des miroirs

pacman-mirrors || sudo pacman-mirrors --continent; sudo pacman -Syu
Cette commande pacman-mirrorsva analyser le status des miroirs; si OK=> Synchronisation et Mise à jour.
Si KO, pacman-mirrors --continent synchronisera les miroirs les plus proches de votre situation géographique.
Attention si vous utilisez un vpn, dans ce cas, l'option -f0 sera plus appropriée. Ensuite la Mise à jour se lancera normalement.
-------------------------------------------------------------------------------------

-------------------------------------------------------------------------------------
ERREUR de clés

Si lors de la mise à jour vous avez des problèmes de clés, essayez de passer les commandes suivantes :

sudo pacman -Syy
sudo pacman -S archlinux-keyring manjaro-keyring
sudo pacman-key --init
sudo pacman-key --populate archlinux manjaro
sudo pacman-key --refresh-keys
Ensuite, vous devriez pouvoir faire votre mise à jour générale sans problème.

-------------------------------------------------------------------------------------

[Stable] Mise à jour 16/08/2022 - Glibc with EAC fix, Nextcloud, KDE-git, Cinnamon, Haskell, Python

#2Messageil y a 1 mois

Salut, maj sous KDE et redémarrage sans problème :clap

[Stable] Mise à jour 16/08/2022 - Glibc with EAC fix, Nextcloud, KDE-git, Cinnamon, Haskell, Python

#3Messageil y a 1 mois

ras sur i3

[Stable] Mise à jour 16/08/2022 - Glibc with EAC fix, Nextcloud, KDE-git, Cinnamon, Haskell, Python

#4Messageil y a 1 mois

:bjr:
51 paquets pour Kde et "pani p'oblem"
Bonne journée
Michel

[Stable] Mise à jour 16/08/2022 - Glibc with EAC fix, Nextcloud, KDE-git, Cinnamon, Haskell, Python

#5Messageil y a 1 mois

Maj de 71 paquets avec ....pamac.

Des soucis à la maj car celui-ci n'arrive pas à installer les dépendances requises.
Obligation de passer en console avec yay sans aucun problème à ce niveau-là.

Par contre, j'ai 3 paquets d'AUR (dont 2 python) qui ne se mettent pas à jour car ils ne passent pas les tests pour les 2 en python et le 3eme stressng à cause pulseaudio. Cela m'était déjà arrivé à cause de pytest avec liquidctl (stable et dev) que je n'arrivais pas à maj sur Cinnamon ni à installer sur KDE. En suivant le conseil de Jonas plus au courant que moi :saispas: j'ai résolut ce problème en installant la version stable de liquidctl disponible dans les dépots de Manjaro.

A mon avis ce problème va aller de manière croissante.
Voici les logs pour stressng, python-dephell-setuptools, stripe-cli

# python-dephell-setuptools

Préparation...
Synchronisation des bases de données des paquets...
Avertissement : stress-ng  : mise à niveau du paquet ignorée (0.13.10-1 => 0.14.00-1)
Avertissement : stripe-cli  : mise à niveau du paquet ignorée (1.7.10-1 => 1.8.1-1)
Clonage des fichiers de construction de python-dephell-setuptools...
Création des informations de python-dephell-setuptools...
Vérification des dépendances de python-dephell-setuptools...
Résolution des dépendances...
Recherche des conflits entre paquets...

Construction de python-dephell-setuptools...
==> Création du paquet python-dephell-setuptools 0.2.5-1 (mar. 16 août 2022 21:55:50)
==> Vérification des dépendances pour l’exécution…
==> Vérification des dépendances pour la compilation…
==> Récupération des sources…
  -> python-dephell-setuptools-0.2.5.tar.gz trouvé
==> Validation des fichiers source avec sha256sums…
    python-dephell-setuptools-0.2.5.tar.gz ... Réussite
==> Suppression du répertoire $srcdir/ existant…
==> Extraction des sources…
  -> Extraction de python-dephell-setuptools-0.2.5.tar.gz avec bsdtar
==> Lancement de prepare()…
==> Suppression du répertoire $pkgdir/ existant…
==> Lancement de build()…
* Getting dependencies for wheel...
/usr/lib/python3.10/site-packages/setuptools/dist.py:757: UserWarning: Usage of dash-separated 'description-file' will not be supported in future versions. Please use the underscore name 'description_file' instead
  warnings.warn(
running egg_info
creating dephell_setuptools.egg-info
writing dephell_setuptools.egg-info/PKG-INFO
writing dependency_links to dephell_setuptools.egg-info/dependency_links.txt
writing top-level names to dephell_setuptools.egg-info/top_level.txt
writing manifest file 'dephell_setuptools.egg-info/SOURCES.txt'
reading manifest file 'dephell_setuptools.egg-info/SOURCES.txt'
adding license file 'LICENSE'
writing manifest file 'dephell_setuptools.egg-info/SOURCES.txt'
* Building wheel...
/usr/lib/python3.10/site-packages/setuptools/dist.py:757: UserWarning: Usage of dash-separated 'description-file' will not be supported in future versions. Please use the underscore name 'description_file' instead
  warnings.warn(
running bdist_wheel
running build
running build_py
creating build
creating build/lib
creating build/lib/dephell_setuptools
copying dephell_setuptools/__init__.py -> build/lib/dephell_setuptools
copying dephell_setuptools/_cmd.py -> build/lib/dephell_setuptools
copying dephell_setuptools/distutils_cmd.py -> build/lib/dephell_setuptools
copying dephell_setuptools/__main__.py -> build/lib/dephell_setuptools
copying dephell_setuptools/_pkginfo.py -> build/lib/dephell_setuptools
copying dephell_setuptools/_base.py -> build/lib/dephell_setuptools
copying dephell_setuptools/_cached_property.py -> build/lib/dephell_setuptools
copying dephell_setuptools/_manager.py -> build/lib/dephell_setuptools
copying dephell_setuptools/_cli.py -> build/lib/dephell_setuptools
copying dephell_setuptools/_static.py -> build/lib/dephell_setuptools
copying dephell_setuptools/_cfg.py -> build/lib/dephell_setuptools
copying dephell_setuptools/_constants.py -> build/lib/dephell_setuptools
installing to build/bdist.linux-x86_64/wheel
running install
running install_lib
creating build/bdist.linux-x86_64
creating build/bdist.linux-x86_64/wheel
creating build/bdist.linux-x86_64/wheel/dephell_setuptools
copying build/lib/dephell_setuptools/__init__.py -> build/bdist.linux-x86_64/wheel/dephell_setuptools
copying build/lib/dephell_setuptools/_cmd.py -> build/bdist.linux-x86_64/wheel/dephell_setuptools
copying build/lib/dephell_setuptools/distutils_cmd.py -> build/bdist.linux-x86_64/wheel/dephell_setuptools
copying build/lib/dephell_setuptools/__main__.py -> build/bdist.linux-x86_64/wheel/dephell_setuptools
copying build/lib/dephell_setuptools/_pkginfo.py -> build/bdist.linux-x86_64/wheel/dephell_setuptools
copying build/lib/dephell_setuptools/_base.py -> build/bdist.linux-x86_64/wheel/dephell_setuptools
copying build/lib/dephell_setuptools/_cached_property.py -> build/bdist.linux-x86_64/wheel/dephell_setuptools
copying build/lib/dephell_setuptools/_manager.py -> build/bdist.linux-x86_64/wheel/dephell_setuptools
copying build/lib/dephell_setuptools/_cli.py -> build/bdist.linux-x86_64/wheel/dephell_setuptools
copying build/lib/dephell_setuptools/_static.py -> build/bdist.linux-x86_64/wheel/dephell_setuptools
copying build/lib/dephell_setuptools/_cfg.py -> build/bdist.linux-x86_64/wheel/dephell_setuptools
copying build/lib/dephell_setuptools/_constants.py -> build/bdist.linux-x86_64/wheel/dephell_setuptools
running install_egg_info
running egg_info
writing dephell_setuptools.egg-info/PKG-INFO
writing dependency_links to dephell_setuptools.egg-info/dependency_links.txt
writing top-level names to dephell_setuptools.egg-info/top_level.txt
reading manifest file 'dephell_setuptools.egg-info/SOURCES.txt'
adding license file 'LICENSE'
writing manifest file 'dephell_setuptools.egg-info/SOURCES.txt'
Copying dephell_setuptools.egg-info to build/bdist.linux-x86_64/wheel/dephell_setuptools-0.0.0-py3.10.egg-info
running install_scripts
creating build/bdist.linux-x86_64/wheel/dephell_setuptools-0.0.0.dist-info/WHEEL
creating '/var/tmp/pamac-build-olivier/python-dephell-setuptools/src/dephell_setuptools-v.0.2.5/dist/tmp7h_y4bgr/dephell_setuptools-0.0.0-py3-none-any.whl' and adding 'build/bdist.linux-x86_64/wheel' to it
adding 'dephell_setuptools/__init__.py'
adding 'dephell_setuptools/__main__.py'
adding 'dephell_setuptools/_base.py'
adding 'dephell_setuptools/_cached_property.py'
adding 'dephell_setuptools/_cfg.py'
adding 'dephell_setuptools/_cli.py'
adding 'dephell_setuptools/_cmd.py'
adding 'dephell_setuptools/_constants.py'
adding 'dephell_setuptools/_manager.py'
adding 'dephell_setuptools/_pkginfo.py'
adding 'dephell_setuptools/_static.py'
adding 'dephell_setuptools/distutils_cmd.py'
adding 'dephell_setuptools-0.0.0.dist-info/LICENSE'
adding 'dephell_setuptools-0.0.0.dist-info/METADATA'
adding 'dephell_setuptools-0.0.0.dist-info/WHEEL'
adding 'dephell_setuptools-0.0.0.dist-info/top_level.txt'
adding 'dephell_setuptools-0.0.0.dist-info/RECORD'
removing build/bdist.linux-x86_64/wheel
Successfully built dephell_setuptools-0.0.0-py3-none-any.whl
==> Lancement de check()…
============================= test session starts ==============================
platform linux -- Python 3.10.5, pytest-7.1.2, pluggy-1.0.0
rootdir: /var/tmp/pamac-build-olivier/python-dephell-setuptools/src/dephell_setuptools-v.0.2.5
plugins: mock-3.8.2
collected 5 items

tests/test_cfg.py F                                                      [ 20%]
tests/test_cmd.py .                                                      [ 40%]
tests/test_static.py ...                                                 [100%]

=================================== FAILURES ===================================
___________________________________ test_cfg ___________________________________

    def test_cfg():
        path = Path(__file__).parent / 'setups' / 'setup.cfg'
>       actual = CfgReader(path).content

tests/test_cfg.py:10: 
_ _ _ _ _ _ _ _ _ _ _ _ _ _ _ _ _ _ _ _ _ _ _ _ _ _ _ _ _ _ _ _ _ _ _ _ _ _ _ _ 
dephell_setuptools/_cached_property.py:17: in __get__
    value = obj.__dict__[self.func.__name__] = self.func(obj)
_ _ _ _ _ _ _ _ _ _ _ _ _ _ _ _ _ _ _ _ _ _ _ _ _ _ _ _ _ _ _ _ _ _ _ _ _ _ _ _ 

self = <dephell_setuptools._cfg.CfgReader object at 0x7f2037795cf0>

    @cached_property
    def content(self) -> Dict[str, Any]:
        path = self.path
        if path.name == 'setup.py':
            path = path.parent / 'setup.cfg'
            if not path.exists():
                raise FileNotFoundError(str(path))
    
        parser = ConfigParser()
        parser.read(str(path))
    
        options = deepcopy(parser._sections)  # type: ignore
        for section, content in options.items():
            for k, v in content.items():
                options[section][k] = ('', v)
    
        container = type('container', (), dict.fromkeys(FIELDS))()
>       ConfigOptionsHandler(container, options).parse()
E       TypeError: ConfigOptionsHandler.__init__() missing 2 required positional arguments: 'ignore_option_errors' and 'ensure_discovered'

dephell_setuptools/_cfg.py:42: TypeError
=========================== short test summary info ============================
FAILED tests/test_cfg.py::test_cfg - TypeError: ConfigOptionsHandler.__init__...
========================= 1 failed, 4 passed in 0.96s ==========================
==> ERREUR : Une erreur s’est produite dans check().
    Abandon…                                                                
                                                                        

# stripe-cli

Préparation...
Synchronisation des bases de données des paquets...
Avertissement : python-dephell-setuptools  : mise à niveau du paquet ignorée (0.2.4-4 => 0.2.5-1)
Avertissement : stress-ng  : mise à niveau du paquet ignorée (0.13.10-1 => 0.14.00-1)
Clonage des fichiers de construction de stripe-cli...
Création des informations de stripe-cli...
Vérification des dépendances de stripe-cli...
Résolution des dépendances...
Recherche des conflits entre paquets...

Construction de stripe-cli...
==> Création du paquet stripe-cli 1.8.1-1 (mar. 16 août 2022 22:00:01)
==> Vérification des dépendances pour l’exécution…
==> Vérification des dépendances pour la compilation…
==> Récupération des sources…
  -> stripe-cli-1.8.1.tar.gz trouvé
  -> reproducible-image-flags.patch trouvé
==> Validation des fichiers source avec sha512sums…
    stripe-cli-1.8.1.tar.gz ... Réussite
    reproducible-image-flags.patch ... Réussite
==> Suppression du répertoire $srcdir/ existant…
==> Extraction des sources…
  -> Extraction de stripe-cli-1.8.1.tar.gz avec bsdtar
==> Lancement de prepare()…
patching file Makefile
Hunk #1 succeeded at 56 with fuzz 1 (offset 1 line).
go mod download
==> Suppression du répertoire $pkgdir/ existant…
==> Lancement de build()…
go generate ./...
writing resources_cmds.go
writing ../proxy/events_list.go
go build \
	-buildmode pie \
	-ldflags "-extldflags -Wl,-O1,--sort-common,--as-needed,-z,relro,-z,now" \
	-trimpath \
	-o stripe \
	cmd/stripe/main.go
==> Lancement de check()…
go test  -failfast -race -coverpkg=./... -covermode=atomic -coverprofile=coverage.txt ./... -run . -timeout=2m
?   	github.com/stripe/stripe-cli/cmd/stripe	[no test files]
?   	github.com/stripe/stripe-cli/pkg/ansi	[no test files]
ok  	github.com/stripe/stripe-cli/pkg/cmd	0.268s	coverage: 15.1% of statements in ./...
?   	github.com/stripe/stripe-cli/pkg/cmd/logs	[no test files]
ok  	github.com/stripe/stripe-cli/pkg/cmd/plugin	0.188s	coverage: 14.0% of statements in ./...
ok  	github.com/stripe/stripe-cli/pkg/cmd/resource	0.231s	coverage: 16.4% of statements in ./...
?   	github.com/stripe/stripe-cli/pkg/cmd/samples	[no test files]
ok  	github.com/stripe/stripe-cli/pkg/config	0.189s	coverage: 14.8% of statements in ./...
ok  	github.com/stripe/stripe-cli/pkg/fixtures	0.300s	coverage: 19.0% of statements in ./...
?   	github.com/stripe/stripe-cli/pkg/git	[no test files]
ok  	github.com/stripe/stripe-cli/pkg/login	0.312s	coverage: 17.3% of statements in ./...
?   	github.com/stripe/stripe-cli/pkg/logout	[no test files]
ok  	github.com/stripe/stripe-cli/pkg/logtailing	0.199s	coverage: 14.0% of statements in ./...
?   	github.com/stripe/stripe-cli/pkg/open	[no test files]
--- FAIL: TestSaveAndCloseToYaml (0.00s)
    interactions_test.go:228: 
        	Error Trace:	interactions_test.go:228
        	Error:      	Not equal: 
        	            	expected: "- type: 0\n  request:\n    method: POST\n    body: hello world\n    headers:\n      Test:\n      - header 1\n    url:\n      scheme: \"\"\n      opaque: \"\"\n      user: null\n      host: \"\"\n      path: \"\"\n      rawpath: \"\"\n      forcequery: false\n      rawquery: \"\"\n      fragment: \"\"\n      rawfragment: \"\"\n  response:\n    headers: {}\n    body: \"\"\n    status_code: 200\n"
        	            	actual  : "- type: 0\n  request:\n    method: POST\n    body: hello world\n    headers:\n      Test:\n      - header 1\n    url:\n      scheme: \"\"\n      opaque: \"\"\n      user: null\n      host: \"\"\n      path: \"\"\n      rawpath: \"\"\n      omithost: false\n      forcequery: false\n      rawquery: \"\"\n      fragment: \"\"\n      rawfragment: \"\"\n  response:\n    headers: {}\n    body: \"\"\n    status_code: 200\n"
        	            	
        	            	Diff:
        	            	--- Expected
        	            	+++ Actual
        	            	@@ -14,2 +14,3 @@
        	            	       rawpath: ""
        	            	+      omithost: false
        	            	       forcequery: false
        	Test:       	TestSaveAndCloseToYaml
FAIL
coverage: 14.8% of statements in ./...
FAIL	github.com/stripe/stripe-cli/pkg/playback	0.223s
ok  	github.com/stripe/stripe-cli/pkg/plugins	0.266s	coverage: 17.4% of statements in ./...
ok  	github.com/stripe/stripe-cli/pkg/proxy	0.194s	coverage: 15.8% of statements in ./...
ok  	github.com/stripe/stripe-cli/pkg/requests	0.232s	coverage: 16.3% of statements in ./...
ok  	github.com/stripe/stripe-cli/pkg/rpcservice	0.403s	coverage: 29.5% of statements in ./...
ok  	github.com/stripe/stripe-cli/pkg/samples	0.174s	coverage: 14.8% of statements in ./...
ok  	github.com/stripe/stripe-cli/pkg/spec	2.297s	coverage: 14.2% of statements in ./...
ok  	github.com/stripe/stripe-cli/pkg/status	0.156s	coverage: 14.3% of statements in ./...
ok  	github.com/stripe/stripe-cli/pkg/stripe	0.195s	coverage: 15.7% of statements in ./...
ok  	github.com/stripe/stripe-cli/pkg/stripeauth	0.151s	coverage: 14.9% of statements in ./...
?   	github.com/stripe/stripe-cli/pkg/terminal	[no test files]
ok  	github.com/stripe/stripe-cli/pkg/terminal/p400	0.158s	coverage: 14.2% of statements in ./...
ok  	github.com/stripe/stripe-cli/pkg/useragent	0.168s	coverage: 13.9% of statements in ./...
ok  	github.com/stripe/stripe-cli/pkg/validators	0.159s	coverage: 14.6% of statements in ./...
ok  	github.com/stripe/stripe-cli/pkg/version	0.140s	coverage: 13.9% of statements in ./...
ok  	github.com/stripe/stripe-cli/pkg/websocket	0.131s	coverage: 15.8% of statements in ./...
?   	github.com/stripe/stripe-cli/rpc	[no test files]
FAIL
make: *** [Makefile:23 : test] Erreur 1
==> ERREUR : Une erreur s’est produite dans check().
    Abandon…

# stressg
                                                                        
 Préparation...
Synchronisation des bases de données des paquets...
Avertissement : python-dephell-setuptools  : mise à niveau du paquet ignorée (0.2.4-4 => 0.2.5-1)
Avertissement : stripe-cli  : mise à niveau du paquet ignorée (1.7.10-1 => 1.8.1-1)
Clonage des fichiers de construction de stress-ng...
Création des informations de stress-ng...
Vérification des dépendances de stress-ng...
Résolution des dépendances...
Recherche des conflits entre paquets...

Construction de stress-ng...
==> Création du paquet stress-ng 0.14.00-1 (mar. 16 août 2022 21:59:00)
==> Vérification des dépendances pour l’exécution…
==> Vérification des dépendances pour la compilation…
==> Récupération des sources…
  -> V0.14.00.tar.gz trouvé
==> Validation des fichiers source avec sha256sums…
    V0.14.00.tar.gz ... Réussite
==> Suppression du répertoire $srcdir/ existant…
==> Extraction des sources…
  -> Extraction de V0.14.00.tar.gz avec bsdtar
==> Suppression du répertoire $pkgdir/ existant…
==> Lancement de build()…
make CC=cc STATIC= -f Makefile.config
make[1] : on entre dans le répertoire « /var/tmp/pamac-build-olivier/stress-ng/src/stress-ng-0.14.00 »
using -lJudy ... no
using aio.h ... yes
using asm/cachectl.h ... no
using -lsctp ... no
using asm/ldt.h ... yes
using -lIPSec_MB ... no
using asm/prctl.h ... yes
using attr/xattr.h ... no
using asm/mtrr.h ... yes
using -lrt ... yes
using -lcrypt ... yes
using -laio ... yes
using -pthread ... yes
using -pthread spinlock ... yes
using -lz ... yes
using -ldl ... yes
using bsd/stdlib.h ... yes
using -lxxhash ... yes
using -lbsd ... yes
using bsd/string.h ... yes
using -ljpeg ... yes
using bsd/sys/tree.h ... yes
using crypt.h ... yes
using complex.h ... yes
using features.h ... yes
using wchar.h ... yes
using grp.h ... yes
using bsd/unistd.h ... yes
using fenv.h ... yes
using float.h ... yes
using bsd/wchar.h ... yes
using -lkmod ... yes
using Judy.h ... no
using jpeglib.h ... yes
using keyutils.h ... yes
using intel-ipsec-mb.h ... no
using libaio.h ... yes
using libgen.h ... yes
using linux/android/binder.h ... yes
using libkmod.h ... yes
using linux/blkzoned.h ... yes
using linux/android/binderfs.h ... yes
using linux/audit.h ... yes
using link.h ... yes
using linux/cdrom.h ... yes
using linux/cn_proc.h ... yes
using linux/connector.h ... yes
using linux/dm-ioctl.h ... yes
using linux/fd.h ... yes
using linux/fiemap.h ... yes
using linux/fsverity.h ... yes
using linux/futex.h ... yes
using linux/filter.h ... yes
using linux/fs.h ... yes
using linux/genetlink.h ... yes
using linux/hdreg.h ... yes
using linux/if_alg.h ... yes
using linux/hpet.h ... yes
using linux/if_packet.h ... yes
using linux/kd.h ... yes
using linux/io_uring.h ... yes
using linux/if_tun.h ... yes
using linux/landlock.h ... yes
using linux/kvm.h ... yes
using linux/loop.h ... yes
using linux/membarrier.h ... yes
using linux/netlink.h ... yes
using linux/mempolicy.h ... yes
using linux/media.h ... yes
using linux/openat2.h ... yes
using linux/pci.h ... yes
using linux/posix_types.h ... yes
using linux/perf_event.h ... yes
using linux/ppdev.h ... yes
using linux/ptp_clock.h ... yes
using linux/random.h ... yes
using linux/rseq.h ... yes
using linux/rtc.h ... yes
using linux/rtnetlink.h ... yes
using linux/seccomp.h ... yes
using linux/socket.h ... yes
using linux/serial.h ... yes
using -lapparmor ... yes
using linux/sockios.h ... yes
using linux/taskstats.h ... yes
using linux/sysctl.h ... yes
using linux/unix_diag.h ... yes
using linux/usbdevice_fs.h ... yes
using linux/udp.h ... yes
using linux/userfaultfd.h ... yes
using linux/vt.h ... yes
using linux/version.h ... yes
using linux/videodev2.h ... yes
using locale.h ... yes
using malloc.h ... yes
using linux/watchdog.h ... yes
using mntent.h ... yes
using scsi/scsi_ioctl.h ... yes
using poll.h ... yes
using scsi/scsi.h ... yes
using mqueue.h ... yes
using linux/sockdiag.h ... yes
using scsi/sg.h ... yes
using semaphore.h ... yes
using strings.h ... yes
using syslog.h ... yes
using spawn.h ... yes
using sound/asound.h ... yes
using sys/auxv.h ... yes
using sys/epoll.h ... yes
using sys/apparmor.h ... yes
using sys/fsuid.h ... yes
using sys/eventfd.h ... yes
using sys/fanotify.h ... yes
using sys/loadavg.h ... no
using sys/io.h ... yes
using sys/inotify.h ... yes
using sys/msg.h ... yes
using sys/ipc.h ... yes
using sys/mount.h ... yes
using sys/param.h ... yes
using sys/personality.h ... yes
using sys/prctl.h ... yes
using sys/platform/ppc.h ... no
using sys/sysctl.h ... no
using sys/capability.h ... yes
using sys/random.h ... yes
using sys/queue.h ... yes
using sys/tree.h ... no
using sys/quota.h ... yes
using sys/select.h ... yes
using sys/sendfile.h ... yes
using sys/signalfd.h ... yes
using sys/statfs.h ... yes
using sys/shm.h ... yes
using sys/statvfs.h ... yes
using sys/uio.h ... yes
using sys/timex.h ... yes
using sys/sysinfo.h ... yes
using sys/sysmacros.h ... yes
using sys/utsname.h ... yes
using sys/ucred.h ... no
using sys/vmmeter.h ... no
using sys/swap.h ... yes
using sys/un.h ... yes
using sys/timerfd.h ... yes
using sys/syscall.h ... yes
using sys/xattr.h ... yes
using sys/vfs.h ... yes
using termios.h ... yes
using termio.h ... yes
using netinet/sctp.h ... no
using netinet/ip.h ... yes
using net/if.h ... yes
using ucontext.h ... yes
using netinet/ip_icmp.h ... yes
using netinet/tcp.h ... yes
using ustat.h ... no
using utime.h ... yes
using xxhash.h ... yes
using darn instruction (power9) ... no
using fence instruction (RISC-V) ... no
using xmmintrin.h ... yes
using 128 byte alignment attribute ... yes
using 64K byte alignment attribute ... yes
using 64 byte alignment attribute ... yes
using clflush instruction (x86) ... yes
using nop instruction ... yes
using __attribute__((fallthrough)) ... yes
using label as value feature ... yes
using asm("") ... yes
using cldemote instruction (x86) ... yes
using pause instruction (x86) ... yes
using clflushopt instruction (x86) ... yes
using tpause instruction (x86) ... yes
using yield instruction (ARM) ... no
using pragma push/pop ... yes
using pragma inside functions ... yes
using rdrand instruction (x86) ... yes
using rdseed instruction (x86) ... yes
using target_clones attribute ... yes
using target_clones mmx attribute (x86) ... yes
using target_clones avx attribute (x86) ... yes
using __restrict keyword ... yes
using target_clones avx2 attribute (x86) ... yes
using target_clones sse2 attribute (x86) ... yes
using target_clones cpu=power9 attribute (power9) ... no
using target_clones sse4_2 attribute (x86) ... yes
using target_clones arch=skylake-avx512 attribute (x86) ... yes
using target_clones sse3 attribute (x86) ... yes
using target_clones arch=sapphirerapids attribute (x86) ... yes
using target_clones sse attribute (x86) ... yes
using target_clones ssse3 attribute (x86) ... yes
using target_clones sse4_1 attribute (x86) ... yes
using target_clones arch=rocketlake attribute (x86) ... yes
using target_clones arch=alderlake attribute (x86) ... yes
using target_clones arch=tigerlake attribute (x86) ... yes
using variable length array function args ... yes
using complex ... yes
using daddr_t ... yes
using dvd_struct ... yes
using float16 ... no
using dvd_authinfo ... yes
using __itimer_which_t ... yes
using __kernel_long_t ... yes
using float64 ... yes
using float80 ... yes
using float32 ... yes
using float decimal32 ... yes
using int128_t ... yes
using ino64_t ... yes
using float decimal64 ... yes
using float decimal128 ... yes
using mode_t ... yes
using loff_t ... yes
using __kernel_ulong_t ... yes
using float128 ... yes
using off64_t ... yes
using landlock_rule_type ... yes
using off_t ... yes
using __pid_type ... yes
using __priority_which_t ... yes
using __rlimit_resource_t ... yes
using struct cdrom_blk ... yes
using pthread_mutexattr_t ... yes
using ptrace_request ... yes
using struct cdrom_msf ... yes
using __rusage_who_t ... yes
using struct cdrom_mcn ... yes
using struct cdrom_subchnl ... yes
using struct cdrom_read_audio ... yes
using struct cdrom_ti ... yes
using struct cdrom_tochdr ... yes
using struct cdrom_tocentry ... yes
using struct cdrom_volctrl ... yes
using struct consolefontdesc ... yes
using struct floppy_drive_struct ... yes
using struct floppy_fdc_state ... yes
using struct dm_ioctl ... yes
using struct fsxattr ... yes
using struct fsverity_enable_arg ... yes
using struct floppy_struct ... yes
using struct kbdiacrs ... yes
using struct fsverity_digest ... yes
using struct iphdr and icmphdr ... yes
using struct ifconf ... yes
using struct landlock_ruleset_attr ... yes
using struct kbentry ... yes
using struct open_how ... no
using struct kbsentry ... yes
using struct kbkeycode ... yes
using struct media_device_info ... yes
using struct msginfo ... yes
using struct mtrr_gentry ... yes
using struct mtrr_sentry ... yes
using struct rusage.ru_minflt ... yes
using struct rtc_param ... yes
using vector math ... yes
using struct serial_icounter_struct ... yes
using struct rusage.ru_nvcsw ... yes
using struct serial_struct ... yes
using struct shminfo ... yes
using struct seccomp_notif_sizes ... yes
using struct shmid_ds ... yes
using struct snd_ctl_card_info ... yes
using struct sockaddr_un ... yes
using struct termios ... yes
using struct snd_ctl_tlv ... yes
using struct unimapdesc ... yes
using struct usbdevfs_getdriver ... yes
using struct user_desc ... yes
using struct vt_stat ... yes
using struct vt_consize ... yes
using struct vt_mode ... yes
using struct vt_sizes ... yes
using struct v4l2_audioout ... yes
using struct v4l2_audio ... yes
using struct v4l2_dv_timings ... yes
using struct v4l2_framebuffer ... yes
using struct winsize ... yes
using struct v4l2_enc_idx ... yes
using struct v4l2_jpegcompression ... yes
using adjtimex ... yes
using struct v4l2_capability ... yes
using affinit ... yes
using v4l2_std_id ... yes
using adjtime ... yes
using accept4 ... yes
using aio_cancel ... yes
using __v2di ... yes
using aio_read ... yes
using aio_write ... yes
using arch_prctl ... yes
using atomics with -latomic ... yes
using aio_fsync ... yes
using __atomic_add_fetch ... yes
using __atomic_clear ... yes
using __atomic_fetch_add ... yes
using __atomic_fetch_add_2 ... yes
using __atomic_and_fetch ... yes
using __atomic_fetch_add_8 ... yes
using __atomic_fetch_add_4 ... yes
using __atomic_fetch_and ... yes
using __atomic_fetch_nand ... yes
using __atomic_fetch_or ... yes
using __atomic_fetch_sub ... yes
using __atomic_fetch_xor ... yes
using __atomic_loa ... yes
using __atomic_nand_fetch ... yes
using __atomic_load ... yes
using __atomic_store ... yes
using __atomic_stor ... yes
using __atomic_or_fetch ... yes
using __atomic_sub_fetch ... yes
using brk ... yes
using __atomic_xor_fetch ... yes
using strlcat ... yes
using strlcpy ... yes
using __builtin_cpu_is(power9) ... no
using __builtin_cabsl ... yes
using __builtin_ccosl ... yes
using __builtin_cosf ... yes
using __builtin_cos ... yes
using __builtin_ctz ... yes
using __builtin_fabsl ... yes
using __builtin_coshl ... yes
using __builtin_cpow ... yes
using __builtin_exp ... yes
using __builtin_expect ... yes
using __builtin_cosl ... yes
using __builtin_ia32_movntdq ... yes
using __builtin_fabs ... yes
using __builtin_csinf ... yes
using __builtin_expl ... yes
using __builtin_csinl ... yes
using __builtin_ia32_movnti ... yes
using __builtin_memcpy ... yes
using __builtin_ia32_movnti64 ... yes
using __builtin_memmove ... yes
using __builtin_lgammal ... yes
using __builtin_parity ... yes
using __builtin_logl ... yes
using __builtin_nontemporal_store ... no
using __builtin_prefetch ... yes
using __builtin_log ... yes
using __builtin_rint ... yes
using __builtin_pow ... yes
using cacheflush ... no
using __builtin_rintl ... yes
using __builtin_ia32_sfence ... yes
using __builtin_sinf ... yes
using __builtin_sin ... yes
using __builtin_supports ... yes
using __builtin___clear_cache ... yes
using __builtin_sinl ... yes
using __builtin_sinhl ... yes
using __builtin_sqrt ... yes
using __builtin_sqrtl ... yes
using chroot ... yes
using ccosf ... yes
using clearenv ... yes
using ccosl ... yes
using clock_nanosleep ... yes
using cimag ... yes
using clock_settime ... yes
using cabsl ... yes
using clock_getres ... yes
using copy_file_range ... yes
using dup3 ... no
using clock_gettime ... yes
using clone ... yes
using crypt_r ... yes
using epoll_create1 ... yes
using eventfd ... yes
using creal ... yes
using endpwent ... yes
using cosl ... yes
using epoll_create ... yes
using coshl ... yes
using cpow ... yes
using execveat ... yes
using __executable_start ... yes
using csinl ... yes
using faccessat2 ... no
using fallocate ... yes
using expl ... yes
using faccessat ... yes
using fgetxattr ... yes
using fdatasync ... yes
using fanotify ... yes
using flock ... yes
using flistxattr ... yes
using fsetxattr ... yes
using fremovexattr ... yes
using fchownat ... yes
using fchmodat ... yes
using futimens ... yes
using fsync ... yes
using getmntinfo ... no
using getauxval ... yes
using futimesat ... yes
using getcpu ... yes
using futimes ... yes
using getdtablesize ... yes
using getdomainname ... yes
using gethostname ... yes
using gethostid ... yes
using getmntent ... yes
using getpgid ... yes
using getpriority ... yes
using getloadavg ... yes
using getpagesize ... yes
using getpgrp ... yes
using getpwent ... yes
using getrusage ... yes
using getrandom ... yes
using getresgid ... yes
using getresuid ... yes
using getxattr ... yes
using gettid ... yes
using getsid ... yes
using iopl ... yes
using inotify1 ... yes
using inotify ... yes
using ioport ... yes
using listxattr ... yes
using llistxattr ... yes
using lgetxattr ... yes
using lremovexattr ... yes
using linkat ... yes
using lookup_dcookie ... yes
using lgammal ... yes
using lseek64 ... yes
using madvise ... yes
using malloc_trim ... yes
using lsetxattr ... yes
using logl ... yes
using lockf ... yes
using mallopt ... yes
using memfd_create ... yes
using mkdirat ... yes
using mincore ... yes
using mlock ... yes
using mknodat ... yes
using mlockall ... yes
using mlock2 ... yes
using mquery ... no
using mprotect ... yes
using mremap ... yes
using munlock ... yes
using munlockall ... yes
using modify_ldt ... yes
using POSIX message queues ... yes
using msync ... yes
using SYS ... yes
using name_to_handle_at ... yes
using nanosleep ... yes
using nice ... yes
using openat ... yes
using openat2 ... yes
using open_by_handle_at ... yes
using pidfd_getfd ... yes
using personality ... yes
using pidfd_send_signal ... yes
using pidfd_open ... yes
using open_memstream ... yes
using pipe2 ... yes
using pkey_alloc ... yes
using posix_madvise ... yes
using __ppc_get_timebas ... no
using pkey_mprotect ... yes
using pkey_get ... yes
using pkey_set ... yes
using pkey_free ... yes
using posix_openpt ... yes
using posix_fadvise ... yes
using posix_fallocate ... yes
using posix_memalign ... yes
using posix_spawn ... yes
using prctl ... yes
using ppoll ... yes
using powl ... yes
using preadv2 ... yes
using preadv ... yes
using process_vm_readv ... yes
using pthread_attr_setstack ... yes
using prlimit ... yes
using process_vm_writev ... yes
using pselect ... yes
using ptrace ... yes
using pthread_mutexattr_setprotocol ... yes
using pthread_mutexattr_destroy ... yes
using pthread_mutexattr_init ... yes
using pthread_mutexattr_setprioceiling ... yes
using ptsname ... yes
using pthread_sigqueue ... yes
using quotactl_fd ... no
using pwritev ... yes
using pwritev2 ... yes
using remap_file_pages ... yes
using removexattr ... yes
using renameat ... yes
using readlinkat ... yes
using renameat2 ... yes
using sched_get_priority_max ... yes
using sched_getaffinity ... yes
using sched_getcpu ... yes
using sbrk ... yes
using sched_get_priority_min ... yes
using recvmmsg ... yes
using sched_rr_get_interval ... yes
using sched_setscheduler ... yes
using sched_yield ... yes
using rintl ... yes
using SYS ... yes
using POSIX semaphores ... yes
using sendfile ... yes
using setfsgid ... yes
using setdomainname ... yes
using setfsuid ... yes
using SYS ... yes
using setpriority ... yes
using setpgid ... yes
using sendmmsg ... yes
using setpgrp ... yes
using setpwent ... yes
using setproctitle ... yes
using setns ... yes
using settimeofday ... yes
using setreuid ... yes
using setresuid ... yes
using setregid ... yes
using setresgid ... yes
using setxattr ... yes
using signalfd ... yes
using sigaltstack ... yes
using sigqueue ... yes
using SYS ... yes
using splice ... yes
using sigwaitinfo ... yes
using statfs ... yes
using statx ... yes
using sinl ... yes
using stime ... no
using swapon ... yes
using sync_bool_compare_and_swap ... yes
using sinhl ... yes
using sqrtl ... yes
using swapcontext ... yes
using sync_file_range ... yes
using sysinfo ... yes
using __sync_synchronize ... yes
using syncfs ... yes
using tcflush ... yes
using tcdrain ... yes
using timerfd_create ... yes
using tee ... yes
using tcflow ... yes
using tcgetattr ... yes
using timer_getoverrrun ... yes
using timerfd_gettime ... yes
using timer_delete ... yes
using timer_gettime ... yes
using timerfd_settime ... yes
using timer_create ... yes
using tgkill ... yes
using timer_settime ... yes
using ttyname ... yes
using uname ... yes
using ustat ... no
using umount2 ... yes
using unlinkat ... yes
using unshare ... yes
using vhangup ... yes
using utimensat ... yes
using wait4 ... yes
using waitid ... yes
using vmsplice ... yes
using wait3 ... yes
using wcscat ... yes
using wcscasecmp ... yes
using wcscmp ... yes
using wcschr ... yes
using wcscoll ... yes
using wcslcat ... yes
using wcscpy ... yes
using wcslen ... yes
using wcslcpy ... yes
using wcsncasecmp ... yes
using wcsncat ... yes
using wcsncmp ... yes
using wcsrchr ... yes
using wcsxfrm ... yes
make[1] : on quitte le répertoire « /var/tmp/pamac-build-olivier/stress-ng/src/stress-ng-0.14.00 »
make stress-ng VERBOSE=
make[1] : on entre dans le répertoire « /var/tmp/pamac-build-olivier/stress-ng/src/stress-ng-0.14.00 »
MK git-commit-id.h
CC stress-peterson.c
CC stress-pidfd.c
CC stress-physpage.c
CC stress-ping-sock.c
CC stress-pipe.c
CC stress-pipeherd.c
CC stress-pkey.c
CC stress-poll.c
CC stress-prctl.c
CC core-perf.c
CC stress-prefetch.c
MK io-uring.h
CC stress-procfs.c
CC stress-pthread.c
MK personality.h
CC stress-ptrace.c
CC stress-pty.c
CC stress-quota.c
CC stress-qsort.c
CC stress-radixsort.c
CC stress-randlist.c
CC stress-ramfs.c
CC stress-rawdev.c
CC stress-rawpkt.c
CC stress-rawsock.c
CC stress-rawudp.c
CC stress-rdrand.c
CC stress-readahead.c
CC stress-reboot.c
CC stress-remap-file-pages.c
CC stress-rename.c
CC stress-resched.c
CC stress-resources.c
CC stress-revio.c
CC stress-rlimit.c
CC stress-rmap.c
CC stress-rseq.c
CC stress-rtc.c
CC stress-sctp.c
CC stress-schedpolicy.c
CC stress-seccomp.c
CC stress-secretmem.c
CC stress-seal.c
CC stress-seek.c
CC stress-sem.c
CC stress-sem-sysv.c
CC stress-sendfile.c
CC stress-session.c
CC stress-set.c
CC stress-shellsort.c
CC stress-shm.c
CC stress-shm-sysv.c
CC stress-sigabrt.c
CC stress-sigchld.c
CC stress-sigfd.c
CC stress-sigfpe.c
CC stress-sigio.c
CC stress-signal.c
CC stress-signest.c
CC stress-sigpending.c
CC stress-sigpipe.c
CC stress-sigq.c
CC stress-sigrt.c
CC stress-sigsegv.c
CC stress-sigsuspend.c
CC stress-sigtrap.c
CC stress-skiplist.c
CC stress-sleep.c
CC stress-smi.c
CC stress-sock.c
CC stress-sockabuse.c
CC stress-sockfd.c
CC stress-sockdiag.c
CC stress-sockpair.c
CC stress-sockmany.c
CC stress-softlockup.c
CC stress-spawn.c
CC stress-sparsematrix.c
CC stress-splice.c
CC stress-stack.c
CC stress-stackmmap.c
CC stress-str.c
CC stress-stream.c
CC stress-swap.c
CC stress-switch.c
CC stress-sync-file.c
CC stress-syncload.c
CC stress-sysbadaddr.c
CC stress-sysinfo.c
CC stress-sysinval.c
CC stress-sysfs.c
CC stress-tee.c
CC stress-timer.c
CC stress-timerfd.c
CC stress-tlb-shootdown.c
CC stress-tmpfs.c
CC stress-tree.c
CC stress-tsc.c
CC stress-tsearch.c
CC stress-tun.c
CC stress-udp.c
CC stress-udp-flood.c
CC stress-unshare.c
CC stress-uprobe.c
CC stress-urandom.c
CC stress-userfaultfd.c
CC stress-usersyscall.c
CC stress-utime.c
CC stress-vdso.c
CC stress-vecmath.c
CC stress-vecwide.c
CC stress-verity.c
CC stress-vforkmany.c
CC stress-vm.c
CC stress-vm-addr.c
CC stress-vm-rw.c
CC stress-vm-segv.c
CC stress-vm-splice.c
CC stress-wait.c
CC stress-watchdog.c
CC stress-wcstr.c
CC stress-x86syscall.c
CC stress-xattr.c
CC stress-yield.c
CC stress-zero.c
CC stress-zlib.c
CC stress-zombie.c
CC core-affinity.c
CC core-cache.c
CC core-cpu.c
CC core-hash.c
CC core-helper.c
CC core-ignite-cpu.c
CC core-io-priority.c
CC core-job.c
CC core-killpid.c
CC core-klog.c
CC core-limit.c
Dans le fichier inclus depuis /usr/include/linux/fs.h:19,
                 depuis core-helper.c:58:
/usr/include/linux/mount.h:95:6: erreur: redéclaration de « enum fsconfig_command »
   95 | enum fsconfig_command {
      |      ^~~~~~~~~~~~~~~~
Dans le fichier inclus depuis core-helper.c:42:
/usr/include/sys/mount.h:189:6: note: défini initialement ici
  189 | enum fsconfig_command
      |      ^~~~~~~~~~~~~~~~
/usr/include/linux/mount.h:96:9: erreur: redéclaration de l'énumération « FSCONFIG_SET_FLAG »
   96 |         FSCONFIG_SET_FLAG       = 0,    /* Set parameter, supplying no value */
      |         ^~~~~~~~~~~~~~~~~
/usr/include/sys/mount.h:191:3: note: la définition précédente de « FSCONFIG_SET_FLAG » avec le type « enum fsconfig_command »
  191 |   FSCONFIG_SET_FLAG       = 0,    /* Set parameter, supplying no value */
      |   ^~~~~~~~~~~~~~~~~
/usr/include/linux/mount.h:97:9: erreur: redéclaration de l'énumération « FSCONFIG_SET_STRING »
   97 |         FSCONFIG_SET_STRING     = 1,    /* Set parameter, supplying a string value */
      |         ^~~~~~~~~~~~~~~~~~~
/usr/include/sys/mount.h:193:3: note: la définition précédente de « FSCONFIG_SET_STRING » avec le type « enum fsconfig_command »
  193 |   FSCONFIG_SET_STRING     = 1,    /* Set parameter, supplying a string value */
      |   ^~~~~~~~~~~~~~~~~~~
/usr/include/linux/mount.h:98:9: erreur: redéclaration de l'énumération « FSCONFIG_SET_BINARY »
   98 |         FSCONFIG_SET_BINARY     = 2,    /* Set parameter, supplying a binary blob value */
      |         ^~~~~~~~~~~~~~~~~~~
/usr/include/sys/mount.h:195:3: note: la définition précédente de « FSCONFIG_SET_BINARY » avec le type « enum fsconfig_command »
  195 |   FSCONFIG_SET_BINARY     = 2,    /* Set parameter, supplying a binary blob value */
      |   ^~~~~~~~~~~~~~~~~~~
/usr/include/linux/mount.h:99:9: erreur: redéclaration de l'énumération « FSCONFIG_SET_PATH »
   99 |         FSCONFIG_SET_PATH       = 3,    /* Set parameter, supplying an object by path */
      |         ^~~~~~~~~~~~~~~~~
/usr/include/sys/mount.h:197:3: note: la définition précédente de « FSCONFIG_SET_PATH » avec le type « enum fsconfig_command »
  197 |   FSCONFIG_SET_PATH       = 3,    /* Set parameter, supplying an object by path */
      |   ^~~~~~~~~~~~~~~~~
/usr/include/linux/mount.h:100:9: erreur: redéclaration de l'énumération « FSCONFIG_SET_PATH_EMPTY »
  100 |         FSCONFIG_SET_PATH_EMPTY = 4,    /* Set parameter, supplying an object by (empty) path */
      |         ^~~~~~~~~~~~~~~~~~~~~~~
/usr/include/sys/mount.h:199:3: note: la définition précédente de « FSCONFIG_SET_PATH_EMPTY » avec le type « enum fsconfig_command »
  199 |   FSCONFIG_SET_PATH_EMPTY = 4,    /* Set parameter, supplying an object by (empty) path */
      |   ^~~~~~~~~~~~~~~~~~~~~~~
/usr/include/linux/mount.h:101:9: erreur: redéclaration de l'énumération « FSCONFIG_SET_FD »
  101 |         FSCONFIG_SET_FD         = 5,    /* Set parameter, supplying an object by fd */
      |         ^~~~~~~~~~~~~~~
/usr/include/sys/mount.h:201:3: note: la définition précédente de « FSCONFIG_SET_FD » avec le type « enum fsconfig_command »
  201 |   FSCONFIG_SET_FD         = 5,    /* Set parameter, supplying an object by fd */
      |   ^~~~~~~~~~~~~~~
/usr/include/linux/mount.h:102:9: erreur: redéclaration de l'énumération « FSCONFIG_CMD_CREATE »
  102 |         FSCONFIG_CMD_CREATE     = 6,    /* Invoke superblock creation */
      |         ^~~~~~~~~~~~~~~~~~~
/usr/include/sys/mount.h:203:3: note: la définition précédente de « FSCONFIG_CMD_CREATE » avec le type « enum fsconfig_command »
  203 |   FSCONFIG_CMD_CREATE     = 6,    /* Invoke superblock creation */
      |   ^~~~~~~~~~~~~~~~~~~
/usr/include/linux/mount.h:103:9: erreur: redéclaration de l'énumération « FSCONFIG_CMD_RECONFIGURE »
  103 |         FSCONFIG_CMD_RECONFIGURE = 7,   /* Invoke superblock reconfiguration */
      |         ^~~~~~~~~~~~~~~~~~~~~~~~
/usr/include/sys/mount.h:205:3: note: la définition précédente de « FSCONFIG_CMD_RECONFIGURE » avec le type « enum fsconfig_command »
  205 |   FSCONFIG_CMD_RECONFIGURE = 7,   /* Invoke superblock reconfiguration */
      |   ^~~~~~~~~~~~~~~~~~~~~~~~
/usr/include/linux/mount.h:129:8: erreur: redéfinition de « struct mount_attr »
  129 | struct mount_attr {
      |        ^~~~~~~~~~
/usr/include/sys/mount.h:161:8: note: défini initialement ici
  161 | struct mount_attr
      |        ^~~~~~~~~~
CC core-log.c
make[1]: *** [Makefile:426 : core-helper.o] Erreur 1
make[1]: *** Attente des tâches non terminées....
CC core-madvise.c
CC usr.bin.pulseaudio.eg
make[1] : on quitte le répertoire « /var/tmp/pamac-build-olivier/stress-ng/src/stress-ng-0.14.00 »
make: *** [Makefile:408 : all] Erreur 2
==> ERREUR : Une erreur s’est produite dans build().
    Abandon…

[Stable] Mise à jour 16/08/2022 - Glibc with EAC fix, Nextcloud, KDE-git, Cinnamon, Haskell, Python

#6Messageil y a 1 mois

:bjr:
Cenwen a écrit : il y a 1 mois python-dephell-setuptools
C'est clairement dans la page aur :wink:

1) ce paquet aur est orphelin (plus de mainteneur) ...
2) ce paquet utilise extra/python-setuptools qui lui est "out-of-date" depuis 2 jours (va falloir attendre une maj arch puis manjaro...)

[Stable] Mise à jour 16/08/2022 - Glibc with EAC fix, Nextcloud, KDE-git, Cinnamon, Haskell, Python

#7Messageil y a 1 mois

Salut je tombe sur ce topic car je trouve avoir un son très faible depuis la dernière mise à jour.
En regardant ma carte son, je vois que j'ai pulseaudio et pipewire actifs en même temps ? Je crois que cela génère un conflit d'où le son faible. Une idée pour m'aider ?

[Stable] Mise à jour 16/08/2022 - Glibc with EAC fix, Nextcloud, KDE-git, Cinnamon, Haskell, Python

#8Messageil y a 1 mois

Bonsoir à vous deux,

@Lemust83 :salut::wink:
Okay merci pour les infos. Il y a pas mal de doc à potasser, c'est en cours d'impression. :gsourire:

C'est vrai pipewire vas remplacer tous ces serveurs de sons. Cela signifie que l'on va avoir pas mal de soucis avec ce logiciel. :desole: Cela résoudra le soucis avec stressg.

@papajoke
C'est vrai que je n'ai pas eu l'idée cette fois de vérifier si c'était du python2, quel programme utilisait cette librairie, ....ni même d'aller voir sur AUR. Il y a des fois ..... :tetu!:tetu!:tetu!

Par contre, j'ai des trucs bizarres sur Plasma/KDE. Non seulement j'ai Yakuake qui s'ouvre quand je démarre l'ordi mais maintenant j'ai en plus un bandeau noir au milieu de l'écran avec Activité qui sort je ne sais d'où depuis la petite maj.
Pour une raison que j'ignore, il m'a suffit de modifier dans application de demarrer une nouvelle session au lieu de l'enregistrer. Bizarre, je n'y ai jamais touché.

Et j'ai plus de Pcloud opérationnel. Est-ce que quelqu'un qui utilise habituellement PCloud a eu ce soucis ? Il n'y a même plus d'icone dans le dossier qui est désespérément vide. A moins que :roll:
Un simple redémarrage de l'application a suffit.
Dernière modification par Cenwenil y a 1 mois, modifié au total 2 fois.

[Stable] Mise à jour 16/08/2022 - Glibc with EAC fix, Nextcloud, KDE-git, Cinnamon, Haskell, Python

#9Messageil y a 1 mois

mise à jour sans problème de mon côté :biere:

[Stable] Mise à jour 16/08/2022 - Glibc with EAC fix, Nextcloud, KDE-git, Cinnamon, Haskell, Python

#10Messageil y a 1 mois

Mise à jour avec problème (Manjaro Gnome)

Au redémarrage Ecran noir après le boot, clavier totalement inopérant, souris inexistante et l'appuie sur la touche Echap, après le message du boot, affichait l'écran que l'on a lors d'une installation :maisnon:
Re-tentative après un arrêt à l'arrache, Gnome s'affiche mais..... aucune application de disponible. La barre supérieure m'affiche le calendrier et un menu plus que léger (réseau, wifi, et les options pour éteindre le PC....). C'est tout :snif

Après extinction propre du PC, je relance la machine et je tombe sur GDM (alors que je suis en automatique pour l'ouverture de ma session), je choisis Gnome Xorg (je me méfie de Wayland), je lance la machine. Ouf, je retrouve tout mais le thème sombre est partiel (barre supérieur blanche etc...). J'éteins de nouveau le PC proprement et je relance en choisissant Wayland et là.....tout redeviens normal :bien

Tout d'un coup j'ai une notification comme quoi le noyau utilisé est obsolète, c'est nouveau car jamais je n'ai eu un tel message. Je vérifie mon noyau est là c'est du 5.15.60. J'installe la version 5.19.1, éteins le PC et re-lance le PC toujours sous wayland....

Ouf, c'est bon, une vérification du noyau, c'est bon.....

Bizarre, bizarre :saispas::saispas:

Je teste mes application fétiche, tout est OK sauf..... Kdenlive :pleure::pleure::pleure: Dans cette application, il y a une possibilité de créer un clip Titre. On peut alors choisir la couleur du texte par appui sur un bouton qui affiche une autre fenêtre mais voilà un tel choix amène un freeze de Kdenlive et sa fermeture.... J'ai fait remonté l'infos sur le forum ad-hoc et j'espère que cela sera rapidement résolu.

A première vue mes autres applications un peu specsss (Freecad, Cura..) semble fonctionner mais je verrais par la suite.

Mon PC est de 2015 (Intel i7 Haschwell) sur carte mère Asus Z97A avec seulement 16Go de RAM DDR3, peut être cela la cause ????

Merci à tous les contributeurs de faire vivre Manjaro

[Stable] Mise à jour 16/08/2022 - Glibc with EAC fix, Nextcloud, KDE-git, Cinnamon, Haskell, Python

#11Messageil y a 1 mois

Salut,
Cenwen a écrit : il y a 1 mois C'est vrai que je n'ai pas eu l'idée cette fois de vérifier si c'était du python2, quel programme utilisait cette librairie, ....ni même d'aller voir sur AUR. Il y a des fois ..... :tetu!:tetu!:tetu!
Ce n'est pas du Python2, c'est simplement le décalage entre Manjaro stable et Arch, les paquets AUR suivant Arch et non Manjaro. Plus j'utilise de logiciels en Python venant de AUR, plus c'est embêtant (pour ne pas dire autre chose). J'en suis même à me demander si je dois passer en unstable ou changer pour Endeavour.

[Stable] Mise à jour 16/08/2022 - Glibc with EAC fix, Nextcloud, KDE-git, Cinnamon, Haskell, Python

#12Messageil y a 1 mois

@Smurf.
Merci pour l'explication. J'espère que non. Amdfan est le seul à faire fonctionner de base et sans rien les ventilateurs de mon GPU. Même lm Sensors n'y arrive pas.

[Stable] Mise à jour 16/08/2022 - Glibc with EAC fix, Nextcloud, KDE-git, Cinnamon, Haskell, Python

#13Messageil y a 1 mois

Cenwen a écrit : il y a 1 mois @Smurf.
Merci pour l'explication. J'espère que non. Amdfan est le seul à faire fonctionner de base et sans rien les ventilateurs de mon GPU. Même lm Sensors n'y arrive pas.
À une époque je rippais mes CD audio avec whipper, j'étais embêté régulièrement, j'ai eu aussi des problèmes avec ulauncher-git, obligé de repasser en stable.
J'utilise Amdgpu-fan, qui est l'outil plus ancien, j'avais voulu passer à Amdfan, mais il fonctionnait quand il avait envie.

[Stable] Mise à jour 16/08/2022 - Glibc with EAC fix, Nextcloud, KDE-git, Cinnamon, Haskell, Python

#14Messageil y a 1 mois

Bonjour,
42 Maj sans problème.

[Stable] Mise à jour 16/08/2022 - Glibc with EAC fix, Nextcloud, KDE-git, Cinnamon, Haskell, Python

#15Messageil y a 1 mois

maj kde sans soucie :bien
Répondre